آتشفشان
preferred label: volcano @en
type: Concept
related: ردوبت

ردوبت
scope note: آتشفشانی در غرب فروافتادگی کوک در پارک ملی لیک کلارک، جنوب آلاسکا
related: آتشفشان
broader: آلاسکای جنوبی
preferred label: Redoubt @en
type: Concept

آلاسکای جنوبی
preferred label: Southern Alaska @en
type: Concept
narrower: ردوبت