خلیج شرقی
preferred label: East Bay @en
type: Concept
related: خلیج گالوستون

تگزاس
preferred label: Texas @en
type: Concept
narrower: خلیج گالوستون

خلیج گالوستون
scope note: شاخه فرعی خلیج مکزیک که از خلیج توسط جزیره گالستون و شبه‌جزیره بولیوار حفاظت شده‌است.
related: خلیج شرقی
broader: تگزاس
preferred label: Galveston Bay @en
type: Concept