جزیره گالوستون
scope note: جزیره‌ای به طول 30 مایل در ورودی خلیج گالوستون.
broader: ناحیه گالوستون تگزاس
preferred label: Galveston Island @en
type: Concept

ناحیه گالوستون تگزاس
preferred label: Galveston County Texas @en
type: Concept
narrower: جزیره گالوستون