جزیره رُود
preferred label: Rhode Island @en
type: Concept
narrower: ناحیه کنت جزیره رود

ناحیه کنت جزیره رود
scope note: روی خلیج نارراگانست در غرب و مرکز جزیره رود.
broader: جزیره رُود
preferred label: Kent County Rhode Island @en
type: Concept