فلوریدا
preferred label: Florida @en
type: Concept
narrower: پنساکولا فلوریدا

پنساکولا فلوریدا
scope note: شهری در خلیج پنساکولا در منتهاالیه شمال غرب فلوریدا
broader: فلوریدا
preferred label: Pensacola Florida @en
type: Concept