ناحیه دووال فلوریدا
scope note: در اقیانوس منجمد جنوبی در شمال شرق فلوریدا.
broader: فلوریدا
preferred label: Duval County Florida @en
type: Concept

فلوریدا
preferred label: Florida @en
type: Concept
narrower: ناحیه دووال فلوریدا