قوس کیپ فیر
scope note: به طرف شمال غرب از طریق دماغه فیر امتداد می‌یابد
broader: کارولینای شمالی
preferred label: Cape Fear Arch @en
type: Concept

کارولینای شمالی
preferred label: North Carolina @en
type: Concept
narrower: قوس کیپ فیر