کالیفرنیا
preferred label: California @en
type: Concept
narrower: دره سان فرناندو

دره سان فرناندو
scope note: حوضه حاصلخیزی در حدود 20 مایلی شمال غرب داون تاون لوس آنجلس
related: گسل سیلمار
broader: کالیفرنیا
preferred label: San Fernando Valley @en
type: Concept

گسل سیلمار
preferred label: Sylmar Fault @en
type: Concept
related: دره سان فرناندو