دریاچه اوونس
scope note: دریاچه خشکی در جنوب انتهای دره اوونس، کالیفرنیای مرکزی
related: دره اوونس
broader: ناحیه اینیو کالیفرنیا
preferred label: Owens Lake @en
type: Concept

دره اوونس
preferred label: Owens Valley @en
type: Concept
related: دریاچه اوونس

ناحیه اینیو کالیفرنیا
preferred label: Inyo County California @en
type: Concept
narrower: دریاچه اوونس