کانزاس
preferred label: Kansas @en
type: Concept
narrower: رودخانه کانزاس

رودخانه کانزاس
scope note: به طرف رودخانه میسوری در شهر کانزاس جریان دارد.
broader: کانزاس
preferred label: Kansas River @en
type: Concept