نیو اورلئان لوئیزیانا
scope note: شهری در کناره رود می سی سی پی در بخش اورلئان، جنوب شرق لوئیزیانا.
broader: لوئیزیانا
preferred label: New Orleans Louisiana @en
type: Concept

لوئیزیانا
preferred label: Louisiana @en
type: Concept
narrower: نیو اورلئان لوئیزیانا