مین
preferred label: Maine @en
type: Concept
narrower: پورتلند ماین

پورتلند ماین
scope note: شهری روی شبه جزیره نزدیک جنوب انتهای خلیج کاسکو در جنوب ماین
broader: مین
preferred label: Portland Maine @en
type: Concept