مونتیسلو مینسوتا
scope note: روستایی در کناره رود می سی سی پی در جنوب مرکز مینسوتا.
broader: مینسوتا
preferred label: Monticello Minnesota @en
type: Concept

مینسوتا
preferred label: Minnesota @en
type: Concept
narrower: مونتیسلو مینسوتا