نیو جرسی
preferred label: New Jersey @en
type: Concept
narrower: ناحیه کامبرلند نیوجرسی

ناحیه کامبرلند نیوجرسی
scope note: توسط خلیج دلاور محدود شده است. جنوب نیوجرسی
broader: نیو جرسی
preferred label: Cumberland County New Jersey @en
type: Concept