واشنگتن
preferred label: Washington @en
type: Concept
narrower: ونکوور واشنگتن

ونکوور واشنگتن
scope note: شهری در کناره رود کلمبیا در جنوب غرب واشنگتن
broader: واشنگتن
preferred label: Vancouver Washington @en
type: Concept