پترزبورگ ویرجینیا
scope note: شهری در جنوب ریچموند. البته مستقل از ناحیه دینویدی، جنوب شرق ویرجینیا
broader: ویرجینیا
preferred label: Petersburg Virginia @en
type: Concept

ویرجینیا
preferred label: Virginia @en
type: Concept
narrower: پترزبورگ ویرجینیا