یوتا
preferred label: Utah @en
type: Concept
narrower: فلات واساچ

فلات واساچ
scope note: فلات بلندی در جنوب انتهای رشته‌کوه واساچ در مرکز یوتا
broader: یوتا
preferred label: Wasatch Plateau @en
type: Concept