ناحیه مدیترانه
preferred label: Mediterranean Region @en
type: Concept
related: البا

توسکانی ایتالیا
preferred label: Tuscany Italy @en
type: Concept
related: البا

البا
scope note: جزیره ای در دریای مدیترانه ما بین کورسیکاو فلات ایتالیا.
related: توسکانی ایتالیا
related: ناحیه مدیترانه
preferred label: Elba @en
type: Concept