فلات ومبات
scope note: کناره شمال غرب استرالیا، مجاور دشت مغاکی آرگو، شرق اقیانوس هند
broader: اقیانوس هند
preferred label: Wombat Plateau @en
type: Concept

اقیانوس هند
preferred label: Indian Ocean @en
type: Concept
narrower: فلات ومبات