دریای سفید
scope note: شاخابه بزرگی از دریای بارنتس در جنوب شبه جزیره کولا در شمال غرب فدراسیون روسیه اروپایی
related: فدراسیون روسیه
broader: دریای بارنتز
preferred label: White Sea @en
type: Concept

فدراسیون روسیه
preferred label: Russian Federation @en
type: Concept
related: دریای سفید

دریای بارنتز
preferred label: Barents Sea @en
type: Concept
narrower: دریای سفید