اطلس شمالی
preferred label: North Atlantic @en
type: Concept
narrower: پشته باربادوس

پشته باربادوس
scope note: امتداد بافته از شمال تا جنوب باربادوس با جزیره ای در مرکز
broader: اطلس شمالی
preferred label: Barbados Ridge @en
type: Concept