پرتگاه فلوریدا
scope note: کناره غربی سپر فلوریدا در شمال شرق حوضه خلیج مکزیک.
related: فلوریدا
broader: خلیج مکزیک
preferred label: Florida Escarpment @en
type: Concept

فلوریدا
preferred label: Florida @en
type: Concept
related: پرتگاه فلوریدا

خلیج مکزیک
preferred label: Gulf of Mexico @en
type: Concept
narrower: پرتگاه فلوریدا