دریای کارائیب
preferred label: Caribbean Sea @en
type: Concept
narrower: حوضه ونزوئلا

حوضه ونزوئلا
scope note: حوضه دریایی مابین جزیره هیسپانیولا تا شمال و ونزوئلا تا جنوب
broader: دریای کارائیب
preferred label: Venezuelan Basin @en
type: Concept