ساحل لیتل باهاما
scope note: جزیره نمایی در شمال باهاما، ما بین جزایر گراندباهاما و گریت آباکو.
related: ساحل باهامای بزرگ
broader: اطلس شمالی
preferred label: Little Bahama Bank @en
type: Concept

ساحل باهامای بزرگ
preferred label: Great Bahama Bank @en
type: Concept
related: ساحل لیتل باهاما

اطلس شمالی
preferred label: North Atlantic @en
type: Concept
narrower: ساحل لیتل باهاما