اقتصاد
preferred label: economics @en
type: Concept
related: اقتصاد معدن

اقتصاد معدن
scope note: زیرشاخه‌ای از اقتصاد که به بررسی قیمت و عرضه و تقاضا و بازاریابی کالاهای معدنی می‌پردازد
related: معدن
related: اقتصاد
preferred label: mining economics @en
type: Concept

معدن
preferred label: mine @en
type: Concept
related: اقتصاد معدن