استرالیا
preferred label: Australia @en
type: Concept
narrower: آدلاید استرالیا

آدلاید استرالیا
scope note: شهری واقع در خلیج سنت وینسنت جنوب شرق استرالیای جنوبی
broader: استرالیا
preferred label: Adelaide Australia @en
type: Concept