استرالیا
preferred label: Australia @en
type: Concept
narrower: ناحیه هارتس

ناحیه هارتس
scope note: جنوب شرق مرکز سرزمین‌های شمالی، استرالیا.
broader: استرالیا
preferred label: Harts range @en
type: Concept