وستلند نیوزیلند
scope note: ناحیه ایالتی در طول دریای تاسمان در غرب جزیره جنوبی، نیوزیلند
related: ایسلند جنوبی
broader: زلاندنو
preferred label: Westland New Zealand @en
type: Concept

ایسلند جنوبی
preferred label: South Island @en
type: Concept
related: وستلند نیوزیلند

زلاندنو
preferred label: New Zealand @en
type: Concept
narrower: وستلند نیوزیلند