ایتالیا
preferred label: Italy @en
type: Concept
narrower: دره تاجلیامنتو

ونتو ایتالیا
preferred label: Veneto Italy @en
type: Concept
related: دره تاجلیامنتو

دره تاجلیامنتو
scope note: دره رودخانه‌ای از آلپ کارنیک تا نوک خلیج ونیس امتداد دارد.
related: ونتو ایتالیا
broader: ایتالیا
preferred label: Tagliamento Valley @en
type: Concept