سولکیس
scope note: ناحیه‌ای در منتهاالیه جنوب غربی ساردینی ایتالیا.
broader: ساردینی ایتالیا
preferred label: Sulcis @en
type: Concept

ساردینی ایتالیا
preferred label: Sardinia Italy @en
type: Concept
narrower: سولکیس