ویدین بلغارستان
scope note: ایالتی در منتهاالیه شمال غربی بلغارستان. دربرگیرنده شهری در کناره رود دانوب نزدیک مرز صربستان
narrower: فرورفتگی لوم
broader: بلغارستان
preferred label: Vidin Bulgaria @en
type: Concept

فرورفتگی لوم
preferred label: Lom Depression @en
type: Concept
broader: ویدین بلغارستان

بلغارستان
preferred label: Bulgaria @en
type: Concept
narrower: ویدین بلغارستان