میدان زغال‌سنگ
preferred label: coal field @en
type: Concept
related: حوضه پتروسانی

ترانسیلوانیا
preferred label: Transylvania @en
type: Concept
narrower: حوضه پتروسانی

حوضه پتروسانی
scope note: حوضه زغال‌سنگی در ناحیه هوندوارا در ترانسیلوانین‌آلپسیی
related: میدان زغال‌سنگ
broader: ترانسیلوانیا
preferred label: Petrosani Basin @en
type: Concept