حوضه مادرید
scope note: حوضه ترشیری که بخش بزرگی از حوضه تانگورا را تشکیل میدهد، مرکز اسپانیا.
related: حوضه تاگوس
broader: اسپانیا
preferred label: Madrid basin @en
type: Concept

حوضه تاگوس
preferred label: Tagus Basin @en
type: Concept
related: حوضه مادرید

اسپانیا
preferred label: Spain @en
type: Concept
narrower: حوضه مادرید