بتیک کوردیلرا
preferred label: Betic Cordillera @en
type: Concept
related: منطقه بتیک

اسپانیا
preferred label: Spain @en
type: Concept
narrower: منطقه بتیک

منطقه بتیک
scope note: همراه با بتیک کوردیلرا در جنوب غرب اسپانیا بکار می رود.
related: بتیک کوردیلرا
broader: اسپانیا
preferred label: Betic Zone @en
type: Concept