واسترویک سوئد
scope note: شهری درکناره دریای بالتیک. در شمال شرق کالمار، جنوب شرق سوئد
broader: سوئد
preferred label: Vastervik Sweden @en
type: Concept

سوئد
preferred label: Sweden @en
type: Concept
narrower: واسترویک سوئد