نروژ
preferred label: Norway @en
type: Concept
narrower: اوسلو نروژ

اوسلو نروژ
scope note: ناحیه‌ای در جنوب شرق نروژ. همچنین شهری در دهانه اوسلو، خلیج کوچکی در اسکاگرات
broader: نروژ
preferred label: Oslo Norway @en
type: Concept