هاینوت بلژیک
preferred label: Hainaut Belgium @en
type: Concept
narrower: تورنای بلژیک

تورنای بلژیک
scope note: شهری در کناره رود اشلت نزدیک مرز فرانسه در غرب هایناوت، جنوب غرب بلژیک
broader: هاینوت بلژیک
preferred label: Tournai Belgium @en
type: Concept