خلیج سین
scope note: شاخابه کانال انگلیسی نرماندی، بین شبه جزیره کوتنیتن در غرب دهانه رودخانه سن در شرق
related: کانال انگلیسی
broader: فرانسه
preferred label: Bay of the Seine @en
type: Concept

کانال انگلیسی
preferred label: English Channel @en
type: Concept
related: خلیج سین

فرانسه
preferred label: France @en
type: Concept
narrower: خلیج سین