رشته‌کوه ووسگس
scope note: رشته‌کوهی که از بلفورت گپ تا مرز آلمان کشیده شده است
related: ووسگس فرانسه
broader: فرانسه
preferred label: Vosges Mountains @en
type: Concept

ووسگس فرانسه
preferred label: Vosges France @en
type: Concept
related: رشته‌کوه ووسگس

فرانسه
preferred label: France @en
type: Concept
narrower: رشته‌کوه ووسگس