فرانسه
preferred label: France @en
type: Concept
narrower: ناربون فرانسه

ناربون فرانسه
scope note: شهری در نزدیکی دریای مدیترانه در شرق ائود، جنوب فرانسه.
broader: فرانسه
preferred label: Narbonne France @en
type: Concept