فرانسه
preferred label: France @en
type: Concept
narrower: نایس فرانسه

نایس فرانسه
scope note: شهری در کناره دریای مدیترانه در ریویرا جنوب آلپ- ماریتیمیز، جنوب شرق فرانسه.
broader: فرانسه
preferred label: Nice France @en
type: Concept