اروپای غربی
preferred label: Western Europe @en
type: Concept
narrower: موناکو

موناکو
scope note: در دریای مدیترانه نزدیک مرز ایتالیا و فرانسه
broader: اروپای غربی
preferred label: Monaco @en
type: Concept