ویر اتریش
scope note: روستایی در کناره رود اِنس در جنوب شرق اتریش علیا، شمال غرب اتریش
broader: اتریش
preferred label: Weyer Austria @en
type: Concept

اتریش
preferred label: Austria @en
type: Concept
narrower: ویر اتریش