پالاتینات فوقانی
alternative label: اوبربخیز
scope note: آن بخش از ناحیه تاریخی پالاتینات که در شرق باواریا جنوب شرق آلمان قرار دارد
related: پالاتینات
broader: باواریا آلمان
preferred label: Upper palatinate @en
type: Concept

پالاتینات
preferred label: Palatinate @en
type: Concept
related: پالاتینات فوقانی

باواریا آلمان
preferred label: Bavaria Germany @en
type: Concept
narrower: پالاتینات فوقانی