حوضه مینز
scope note: ناحیه ای پیرامون اتصال دو رود مین و راین. آلمان.
related: هسه آلمان
broader: آلمان
preferred label: Mainz Basin @en
type: Concept

هسه آلمان
preferred label: Hesse Germany @en
type: Concept
related: حوضه مینز

آلمان
preferred label: Germany @en
type: Concept
narrower: حوضه مینز