اروپای مرکزی
preferred label: Central Europe @en
type: Concept
narrower: جنگل سیاه

جنگل سیاه
scope note: ناحیه کوهستانی در غرب بادن- ووتمبرگ که به سمت شمال غرب سوئیس گسترش می یابد.
related: سوئیس
broader: اروپای مرکزی
preferred label: Black Forest @en
type: Concept

سوئیس
preferred label: Switzerland @en
type: Concept
related: جنگل سیاه