زوریخ سوئیس
scope note: بخشی در شمال سوئیس. ضمناً شهری در شمال غرب انتهای دریاچه زوریخ
broader: سوئیس
preferred label: Zurich Switzerland @en
type: Concept

سوئیس
preferred label: Switzerland @en
type: Concept
narrower: زوریخ سوئیس