لهستان
preferred label: Poland @en
type: Concept
narrower: سوالکی لهستان

سوالکی لهستان
scope note: ناحیه و شهری در شرق دریاچه‌های ماسورین در شمال شرق سووالکی، منتهاالیه شمال شرق لسهتان.
broader: لهستان
preferred label: Suwalki Poland @en
type: Concept