گدانسک لهستان
scope note: ایالتی در شمال لهستان. همچنین نام شهری در خلیج دانزیگ.
broader: لهستان
preferred label: Gdansk Poland @en
type: Concept

لهستان
preferred label: Poland @en
type: Concept
narrower: گدانسک لهستان