لوساتیا
preferred label: Lusatia @en
type: Concept
related: لوساتیای زیرین

لوساتیای زیرین
scope note: آن بخش از لوساتیا که ما بین رودهای نیس و بوبر در جنوب غرب لهستان قرار دارد.
related: لوساتیا
broader: لهستان
preferred label: Lower Lusatia @en
type: Concept

لهستان
preferred label: Poland @en
type: Concept
narrower: لوساتیای زیرین